𝐅𝐄𝐁𝐙 𝐒𝐇𝐀𝐑𝐄 𝐂𝐄𝐍𝐓𝐑𝐀𝐋
Відкрити в Telegram
Показати більше
Країна не вказанаКатегорія не вказана
1 167
Підписники
Немає даних24 години
-17 днів
-130 днів
Архів дописів
1 167
Available murband telegram
- get metode bans account - get metode bans chanel - get metode bans group - get metode report dsa - get metode report via email - get metode bans tfo - full pengajaran - get metode bans account vcs
- fast bans - work 98% - mt? always up - anti ga di urus
Join dm @admiraldu
1 167
🚀 User Start Bot
👤 Nama: '𝕽𝖆𝖐𝖟𝖟𝖐𝖆𝖈𝖎𝖜𝖜'
🆔 ID:
8935015628
🔗 Username: Kinggzz1
🔥 Mau coba bot? Gaskeun!1 167
🚀 User Start Bot
👤 Nama: |𝐒𝐘𝐍
🆔 ID:
8763898031
🔗 Username: maklowcolmax
🔥 Mau coba bot? Gaskeun!1 167
🚀 User Add Token
👤 Nama: '𝕽𝖆𝖐𝖟𝖟𝖐𝖆𝖈𝖎𝖜𝖜'
🆔 ID:
8935015628
🔗 Username: Kinggzz1
🔥 Mau coba bot? Gaskeun!1 167
🚀 User Start Bot
👤 Nama: '𝕽𝖆𝖐𝖟𝖟𝖐𝖆𝖈𝖎𝖜𝖜'
🆔 ID:
8935015628
🔗 Username: Kinggzz1
🔥 Mau coba bot? Gaskeun!1 167
❌ LIVE BUILD MONITOR ❌
━━━━━━━━━━━━━━━━━━━━━━
👤 Developer : '𝕽𝖆𝖐𝖟𝖟𝖐𝖆𝖈𝖎𝖜𝖜'
🆔 User ID :
8935015628
📦 Project : PURPLE SNAK BY VOREXX.zip
🔧 Mode : 🚀 Release Build
📊 PROGRES AKTIF:
STATUS ➜ FAILED ERROR
DETAIL ➜ Eror terdeteksi pada baris kodingan tahap: Setup Android SDK.
━━━━━━━━━━━━━━━━━━━━━━
⏱ Waktu Berjalan: 1 Menit 42 Detik
🤖 Multi-build Server Active — Proses berjalan independen.1 167
❌ LIVE BUILD MONITOR ❌
━━━━━━━━━━━━━━━━━━━━━━
👤 Developer : '𝕽𝖆𝖐𝖟𝖟𝖐𝖆𝖈𝖎𝖜𝖜'
🆔 User ID :
8935015628
📦 Project : PURPLE SNAK BY VOREXX.zip
🔧 Mode : 🚀 Release Build
📊 PROGRES AKTIF:
STATUS ➜ FAILED ERROR
DETAIL ➜ Eror terdeteksi pada baris kodingan tahap: Setup Android SDK.
━━━━━━━━━━━━━━━━━━━━━━
⏱ Waktu Berjalan: 1 Menit 44 Detik
🤖 Multi-build Server Active — Proses berjalan independen.1 167
❌ LIVE BUILD MONITOR ❌
━━━━━━━━━━━━━━━━━━━━━━
👤 Developer : '𝕽𝖆𝖐𝖟𝖟𝖐𝖆𝖈𝖎𝖜𝖜'
🆔 User ID :
8935015628
📦 Project : PURPLE SNAK BY VOREXX.zip
🔧 Mode : 🚀 Release Build
📊 PROGRES AKTIF:
STATUS ➜ FAILED ERROR
DETAIL ➜ Eror terdeteksi pada baris kodingan tahap: Setup Android SDK.
━━━━━━━━━━━━━━━━━━━━━━
⏱ Waktu Berjalan: 1 Menit 22 Detik
🤖 Multi-build Server Active — Proses berjalan independen.1 167
❌ LIVE BUILD MONITOR ❌
━━━━━━━━━━━━━━━━━━━━━━
👤 Developer : '𝕽𝖆𝖐𝖟𝖟𝖐𝖆𝖈𝖎𝖜𝖜'
🆔 User ID :
8935015628
📦 Project : PURPLE SNAK BY VOREXX.zip
🔧 Mode : 🚀 Release Build
📊 PROGRES AKTIF:
STATUS ➜ FAILED ERROR
DETAIL ➜ Eror terdeteksi pada baris kodingan tahap: Setup Android SDK.
━━━━━━━━━━━━━━━━━━━━━━
⏱ Waktu Berjalan: 2 Menit 18 Detik
🤖 Multi-build Server Active — Proses berjalan independen.1 167
❌ LIVE BUILD MONITOR ❌
━━━━━━━━━━━━━━━━━━━━━━
👤 Developer : '𝕽𝖆𝖐𝖟𝖟𝖐𝖆𝖈𝖎𝖜𝖜'
🆔 User ID :
8935015628
📦 Project : PURPLE SNAK BY VOREXX.zip
🔧 Mode : 🚀 Release Build
📊 PROGRES AKTIF:
STATUS ➜ FAILED ERROR
DETAIL ➜ Eror terdeteksi pada baris kodingan tahap: Setup Android SDK.
━━━━━━━━━━━━━━━━━━━━━━
⏱ Waktu Berjalan: 1 Menit 35 Detik
🤖 Multi-build Server Active — Proses berjalan independen.1 167
❌ LIVE BUILD MONITOR ❌
━━━━━━━━━━━━━━━━━━━━━━
👤 Developer : '𝕽𝖆𝖐𝖟𝖟𝖐𝖆𝖈𝖎𝖜𝖜'
🆔 User ID :
8935015628
📦 Project : PURPLE SNAK BY VOREXX.zip
🔧 Mode : 🚀 Release Build
📊 PROGRES AKTIF:
STATUS ➜ FAILED ERROR
DETAIL ➜ Eror terdeteksi pada baris kodingan tahap: Setup Android SDK.
━━━━━━━━━━━━━━━━━━━━━━
⏱ Waktu Berjalan: 1 Menit 59 Detik
🤖 Multi-build Server Active — Proses berjalan independen.1 167
❌ LIVE BUILD MONITOR ❌
━━━━━━━━━━━━━━━━━━━━━━
👤 Developer : '𝕽𝖆𝖐𝖟𝖟𝖐𝖆𝖈𝖎𝖜𝖜'
🆔 User ID :
8935015628
📦 Project : PURPLE SNAK BY VOREXX.zip
🔧 Mode : 🚀 Release Build
📊 PROGRES AKTIF:
STATUS ➜ FAILED ERROR
DETAIL ➜ Eror terdeteksi pada baris kodingan tahap: Setup Android SDK.
━━━━━━━━━━━━━━━━━━━━━━
⏱ Waktu Berjalan: 1 Menit 48 Detik
🤖 Multi-build Server Active — Proses berjalan independen.1 167
❌ LIVE BUILD MONITOR ❌
━━━━━━━━━━━━━━━━━━━━━━
👤 Developer : '𝕽𝖆𝖐𝖟𝖟𝖐𝖆𝖈𝖎𝖜𝖜'
🆔 User ID :
8935015628
📦 Project : PURPLE SNAK BY VOREXX.zip
🔧 Mode : 🚀 Release Build
📊 PROGRES AKTIF:
STATUS ➜ BUILD FAILED
DETAIL ➜ Terjadi kesalahan penulisan kode sintaks/eror manifes pada proyek.
━━━━━━━━━━━━━━━━━━━━━━
⏱ Waktu Berjalan: 53 Detik
🤖 Multi-build Server Active — Proses berjalan independen.1 167
❌ LIVE BUILD MONITOR ❌
━━━━━━━━━━━━━━━━━━━━━━
👤 Developer : '𝕽𝖆𝖐𝖟𝖟𝖐𝖆𝖈𝖎𝖜𝖜'
🆔 User ID :
8935015628
📦 Project : Base NovaX new.zip
🔧 Mode : 🚀 Release Build
📊 PROGRES AKTIF:
STATUS ➜ FAILED ERROR
DETAIL ➜ Eror terdeteksi pada baris kodingan tahap: Validasi pubspec.yaml.
━━━━━━━━━━━━━━━━━━━━━━
⏱ Waktu Berjalan: 1 Menit 10 Detik
🤖 Multi-build Server Active — Proses berjalan independen.1 167
❌ LIVE BUILD MONITOR ❌
━━━━━━━━━━━━━━━━━━━━━━
👤 Developer : '𝕽𝖆𝖐𝖟𝖟𝖐𝖆𝖈𝖎𝖜𝖜'
🆔 User ID :
8935015628
📦 Project : Base NovaX new.zip
🔧 Mode : 🚀 Release Build
📊 PROGRES AKTIF:
STATUS ➜ FAILED ERROR
DETAIL ➜ Eror terdeteksi pada baris kodingan tahap: Validasi pubspec.yaml.
━━━━━━━━━━━━━━━━━━━━━━
⏱ Waktu Berjalan: 35 Detik
🤖 Multi-build Server Active — Proses berjalan independen.