π πππ πππππ πππππππ
ΠΡΠΊΡΡΡΡ Π² Telegram
ΠΠΎΠ»ΡΡΠ΅
Π‘ΡΡΠ°Π½Π° Π½Π΅ ΡΠΊΠ°Π·Π°Π½Π°ΠΠ°ΡΠ΅Π³ΠΎΡΠΈΡ Π½Π΅ ΡΠΊΠ°Π·Π°Π½Π°
1 165
ΠΠΎΠ΄ΠΏΠΈΡΡΠΈΠΊΠΈ
ΠΠ΅Ρ Π΄Π°Π½Π½ΡΡ
24 ΡΠ°ΡΠ°
-17 Π΄Π½Π΅ΠΉ
-130 Π΄Π½Π΅ΠΉ
ΠΡΡ
ΠΈΠ² ΠΏΠΎΡΡΠΎΠ²
info yang mau join full up SC gw -4 orang lagi free no bayar kecuali up
Available murband telegram
- get metode bans account - get metode bans chanel - get metode bans group - get metode report dsa - get metode report via email - get metode bans tfo - full pengajaran - get metode bans account vcs
- ο»Ώfast bans - work 98% - mt? always up - anti ga di urus
Join dm @admiraldu
π User Start Bot
π€ Nama: 'π½ππππππππππ'
π ID:
8935015628
π Username: Kinggzz1
π₯ Mau coba bot? Gaskeun!π User Start Bot
π€ Nama: |πππ
π ID:
8763898031
π Username: maklowcolmax
π₯ Mau coba bot? Gaskeun!π User Add Token
π€ Nama: 'π½ππππππππππ'
π ID:
8935015628
π Username: Kinggzz1
π₯ Mau coba bot? Gaskeun!π User Start Bot
π€ Nama: 'π½ππππππππππ'
π ID:
8935015628
π Username: Kinggzz1
π₯ Mau coba bot? Gaskeun!β LIVE BUILD MONITOR β
ββββββββββββββββββββββ
π€ Developer : 'π½ππππππππππ'
π User ID :
8935015628
π¦ Project : PURPLE SNAK BY VOREXX.zip
π§ Mode : π Release Build
π PROGRES AKTIF:
STATUS β FAILED ERROR
DETAIL β Eror terdeteksi pada baris kodingan tahap: Setup Android SDK.
ββββββββββββββββββββββ
β± Waktu Berjalan: 1 Menit 42 Detik
π€ Multi-build Server Active β Proses berjalan independen.β LIVE BUILD MONITOR β
ββββββββββββββββββββββ
π€ Developer : 'π½ππππππππππ'
π User ID :
8935015628
π¦ Project : PURPLE SNAK BY VOREXX.zip
π§ Mode : π Release Build
π PROGRES AKTIF:
STATUS β FAILED ERROR
DETAIL β Eror terdeteksi pada baris kodingan tahap: Setup Android SDK.
ββββββββββββββββββββββ
β± Waktu Berjalan: 1 Menit 44 Detik
π€ Multi-build Server Active β Proses berjalan independen.β LIVE BUILD MONITOR β
ββββββββββββββββββββββ
π€ Developer : 'π½ππππππππππ'
π User ID :
8935015628
π¦ Project : PURPLE SNAK BY VOREXX.zip
π§ Mode : π Release Build
π PROGRES AKTIF:
STATUS β FAILED ERROR
DETAIL β Eror terdeteksi pada baris kodingan tahap: Setup Android SDK.
ββββββββββββββββββββββ
β± Waktu Berjalan: 1 Menit 22 Detik
π€ Multi-build Server Active β Proses berjalan independen.β LIVE BUILD MONITOR β
ββββββββββββββββββββββ
π€ Developer : 'π½ππππππππππ'
π User ID :
8935015628
π¦ Project : PURPLE SNAK BY VOREXX.zip
π§ Mode : π Release Build
π PROGRES AKTIF:
STATUS β FAILED ERROR
DETAIL β Eror terdeteksi pada baris kodingan tahap: Setup Android SDK.
ββββββββββββββββββββββ
β± Waktu Berjalan: 2 Menit 18 Detik
π€ Multi-build Server Active β Proses berjalan independen.β LIVE BUILD MONITOR β
ββββββββββββββββββββββ
π€ Developer : 'π½ππππππππππ'
π User ID :
8935015628
π¦ Project : PURPLE SNAK BY VOREXX.zip
π§ Mode : π Release Build
π PROGRES AKTIF:
STATUS β FAILED ERROR
DETAIL β Eror terdeteksi pada baris kodingan tahap: Setup Android SDK.
ββββββββββββββββββββββ
β± Waktu Berjalan: 1 Menit 35 Detik
π€ Multi-build Server Active β Proses berjalan independen.β LIVE BUILD MONITOR β
ββββββββββββββββββββββ
π€ Developer : 'π½ππππππππππ'
π User ID :
8935015628
π¦ Project : PURPLE SNAK BY VOREXX.zip
π§ Mode : π Release Build
π PROGRES AKTIF:
STATUS β FAILED ERROR
DETAIL β Eror terdeteksi pada baris kodingan tahap: Setup Android SDK.
ββββββββββββββββββββββ
β± Waktu Berjalan: 1 Menit 59 Detik
π€ Multi-build Server Active β Proses berjalan independen.β LIVE BUILD MONITOR β
ββββββββββββββββββββββ
π€ Developer : 'π½ππππππππππ'
π User ID :
8935015628
π¦ Project : PURPLE SNAK BY VOREXX.zip
π§ Mode : π Release Build
π PROGRES AKTIF:
STATUS β FAILED ERROR
DETAIL β Eror terdeteksi pada baris kodingan tahap: Setup Android SDK.
ββββββββββββββββββββββ
β± Waktu Berjalan: 1 Menit 48 Detik
π€ Multi-build Server Active β Proses berjalan independen.β LIVE BUILD MONITOR β
ββββββββββββββββββββββ
π€ Developer : 'π½ππππππππππ'
π User ID :
8935015628
π¦ Project : PURPLE SNAK BY VOREXX.zip
π§ Mode : π Release Build
π PROGRES AKTIF:
STATUS β BUILD FAILED
DETAIL β Terjadi kesalahan penulisan kode sintaks/eror manifes pada proyek.
ββββββββββββββββββββββ
β± Waktu Berjalan: 53 Detik
π€ Multi-build Server Active β Proses berjalan independen.β LIVE BUILD MONITOR β
ββββββββββββββββββββββ
π€ Developer : 'π½ππππππππππ'
π User ID :
8935015628
π¦ Project : Base NovaX new.zip
π§ Mode : π Release Build
π PROGRES AKTIF:
STATUS β FAILED ERROR
DETAIL β Eror terdeteksi pada baris kodingan tahap: Validasi pubspec.yaml.
ββββββββββββββββββββββ
β± Waktu Berjalan: 1 Menit 10 Detik
π€ Multi-build Server Active β Proses berjalan independen.β LIVE BUILD MONITOR β
ββββββββββββββββββββββ
π€ Developer : 'π½ππππππππππ'
π User ID :
8935015628
π¦ Project : Base NovaX new.zip
π§ Mode : π Release Build
π PROGRES AKTIF:
STATUS β FAILED ERROR
DETAIL β Eror terdeteksi pada baris kodingan tahap: Validasi pubspec.yaml.
ββββββββββββββββββββββ
β± Waktu Berjalan: 35 Detik
π€ Multi-build Server Active β Proses berjalan independen.